Target
Inhibitor of nuclear factor kappa-B kinase subunit beta
Ligand
BDBM312840
Substrate
Meas. Tech.
NIK Enzyme Inhibition Assay
Ki
0.110±n/a nM
Citation
 Blaquiere, NCastanedo, GFeng, JAHu, BStaben, SYuen, PWu, GBurch, J Alkynyl alcohols and methods of use US Patent  US9605005 Publication Date 3/28/2017 
Target
Name:
Inhibitor of nuclear factor kappa-B kinase subunit beta
Synonyms:
I-kappa-B Kinase 2 (IKK-beta) I-kappa-B-kinase beta IKBKB IKK-beta IKK2/IKK1 IKKB_HUMAN Inhibitor of nuclear factor kappa B kinase beta subunit Nuclear factor NF-kappa-B inhibitor kinase beta
Type:
Serine/threonine-protein kinase
Mol. Mass.:
86554.39
Organism:
Homo sapiens (Human)
Description:
GST-tagged IKK-2 was expressed in High Five cells and purified.
Residue:
756
  
Inhibitor
Name:
BDBM312840
Synonyms:
4-(cyclopropylamino)-1-[3- [2-[(3R)-3-hydroxy-1-meth- yl-2-oxo-pyrrolidin-3-yl]eth- ynyl]phenyl]pyrazolo[4,3- c]pyridine-3-carboxamide | US9605005, Example 130
Type:
Small organic molecule
Emp. Form.:
C23H22N6O3
Mol. Mass.:
430.4592
SMILES:
CN1CC[C@@](O)(C#Cc2cccc(c2)-n2nc(C(N)=O)c3c(NC4CC4)nccc23)C1=O
: