Target
Cytochrome P450 2D6
Ligand
BDBM223406
Substrate
Meas. Tech.
Inhibition Assay
IC50
65.0±n/a nM
Citation
 Brodney, MABeck, EMButler, CRZhang, LO Neill, BTBarreiro, GLaChapelle, EARogers, BN 2-amino-6-methyl-4,4a,5,6-tetrahydropyrano[3,4-d][1,3]thiazin-8a(8H)-yl-1,3-thiazol-4-yl amides US Patent  US9605007 Publication Date 3/28/2017 
Target
Name:
Cytochrome P450 2D6
Synonyms:
CP2D6_HUMAN CYP2DL1 Cytochrome P450 2D6 (CYP2D6) P450-DB1
Type:
Protein
Mol. Mass.:
55774.82
Organism:
Homo sapiens (Human)
Description:
P10635
Residue:
497
  
Inhibitor
Name:
BDBM223406
Synonyms:
US9315520, Comparator 4 | US9605007, Comparator 4
Type:
Small organic molecule
Emp. Form.:
C20H19F3N4O3S
Mol. Mass.:
452.45
SMILES:
[H][C@@]12CCOC[C@@]1(N=C(N)SC2)c1cc(NC(=O)c2ccc(OC(F)F)cn2)ccc1F
: