Target
Beta-secretase 1
Ligand
BDBM312941
Substrate
Meas. Tech.
Cell-Free Assay
IC50
4.00±n/a nM
Citation
 Brodney, MABeck, EMButler, CRZhang, LO Neill, BTBarreiro, GLaChapelle, EARogers, BN 2-amino-6-methyl-4,4a,5,6-tetrahydropyrano[3,4-d][1,3]thiazin-8a(8H)-yl-1,3-thiazol-4-yl amides US Patent  US9605007 Publication Date 3/28/2017 
Target
Name:
Beta-secretase 1
Synonyms:
ASP2 Aspartyl protease 2 BACE1 Beta-secretase (BACE) Beta-secretase 1 (BACE 1) Beta-secretase 1 (BACE1) Beta-site amyloid precursor protein cleaving enzyme 1 Memapsin-2 beta-Secretase (BACE-1) | beta-Secretase (BACE1)
Type:
Protein
Mol. Mass.:
55755.10
Organism:
Homo sapiens (Human)
Description:
P56817
Residue:
501
  
Inhibitor
Name:
BDBM312941
Synonyms:
N-{2-[(4aR,6S,8aR)-2-amino-6-methyl-4,4a,5,6-tetrahydropyrano[3,4-d][1,3]thiazin-8a(8H)-yl]-1,3-thiazol-4-yl}-4-chloro-1-(difluoromethyl)-1H-pyrazole-3-carboxamide | US9605007, Example 6
Type:
Small Organic Molecule
Emp. Form.:
C16H17ClF2N6O2S2
Mol. Mass.:
462.925
SMILES:
C[C@H]1C[C@H]2CSC(N)=N[C@]2(CO1)c1nc(NC(=O)c2nn(cc2Cl)C(F)F)cs1
: