Target
Beta-secretase 1
Ligand
BDBM223335
Substrate
Meas. Tech.
Cell-Free Assay
IC50
13±n/a nM
Citation
 Brodney, MABeck, EMButler, CRZhang, LO Neill, BTBarreiro, GLaChapelle, EARogers, BN 2-amino-6-methyl-4,4a,5,6-tetrahydropyrano[3,4-d][1,3]thiazin-8a(8H)-yl-1,3-thiazol-4-yl amides US Patent  US9605007 Publication Date 3/28/2017 
Target
Name:
Beta-secretase 1
Synonyms:
ASP2 Aspartyl protease 2 BACE1 Beta-secretase (BACE) Beta-secretase 1 (BACE 1) Beta-secretase 1 (BACE1) Beta-site amyloid precursor protein cleaving enzyme 1 Memapsin-2 beta-Secretase (BACE-1) | beta-Secretase (BACE1)
Type:
Protein
Mol. Mass.:
55755.10
Organism:
Homo sapiens (Human)
Description:
P56817
Residue:
501
  
Inhibitor
Name:
BDBM223335
Synonyms:
US9315520, 22 US9744173, Example 22
Type:
Small organic molecule
Emp. Form.:
C20H22N6O3S2
Mol. Mass.:
458.557
SMILES:
CC#CCOc1cnc(cn1)C(=O)Nc1csc(n1)[C@]12CO[C@@H](C)C[C@H]1CSC(N)=N2
: