Target
Tyrosine-protein kinase receptor UFO
Ligand
BDBM313015
Substrate
Meas. Tech.
PHOSPHO-AKT IN-CELL WESTERN ASSAY
IC50
<1000±n/a nM
Citation
 Goff, DZhang, JSylvain, CSingh, RHolland, SYu, JHeckrodt, TJDing, P Substituted triazoles useful as Axl inhibitors US Patent  US10166216 Publication Date 1/1/2019 
Target
Name:
Tyrosine-protein kinase receptor UFO
Synonyms:
AXL TEL/AXL UFO | UFO_HUMAN
Type:
Enzyme
Mol. Mass.:
98316.97
Organism:
Homo sapiens (Human)
Description:
P30530
Residue:
894
  
Inhibitor
Name:
BDBM313015
Synonyms:
N-{2-[(4aR,6S,8aR)-2-amino-6-methyl-4,4a,5,6-tetrahydropyrano[3,4-d][1,3]thiazin-8a(8H)-yl]-1,3-thiazol-4-yl}-3-ethyl-1,2-oxazole-5-carboxamide US9605007, Example 71
Type:
Small Organic Molecule
Emp. Form.:
C22H24N8O
Mol. Mass.:
416.479
SMILES:
Nc1nc(Nc2ccc(OCCN3CCCC3)cc2)nn1-c1nncc2ccccc12
: