Target
Tyrosine-protein kinase receptor UFO
Ligand
BDBM313030
Substrate
Meas. Tech.
PHOSPHO-AKT IN-CELL WESTERN ASSAY
IC50
<1000±n/a nM
Citation
 Goff, DZhang, JSylvain, CSingh, RHolland, SYu, JHeckrodt, TJDing, P Substituted triazoles useful as Axl inhibitors US Patent  US10166216 Publication Date 1/1/2019 
Target
Name:
Tyrosine-protein kinase receptor UFO
Synonyms:
AXL TEL/AXL UFO | UFO_HUMAN
Type:
Enzyme
Mol. Mass.:
98316.97
Organism:
Homo sapiens (Human)
Description:
P30530
Residue:
894
  
Inhibitor
Name:
BDBM313030
Synonyms:
N-{2-[(4aR,6S,8aR)-2-amino-6-methyl-4,4a,5,6-tetrahydropyrano[3,4-d][1,3]thiazin-8a(8H)-yl]-1,3-thiazol-4-yl}-2-(propan-2-yl)-1,3-oxazole-4-carboxamide US9605007, Example 86
Type:
Small Organic Molecule
Emp. Form.:
C22H25ClN8O
Mol. Mass.:
452.94
SMILES:
Cn1c(nc2ccccc12)-n1nc(Nc2ccc(OCCN3CCCC3)c(Cl)c2)nc1N
: