Target
Tyrosine-protein kinase receptor UFO
Ligand
BDBM313073
Substrate
Meas. Tech.
PHOSPHO-AKT IN-CELL WESTERN ASSAY
IC50
<1000±n/a nM
Citation
 Goff, DZhang, JSylvain, CSingh, RHolland, SYu, JHeckrodt, TJDing, P Substituted triazoles useful as Axl inhibitors US Patent  US10166216 Publication Date 1/1/2019 
Target
Name:
Tyrosine-protein kinase receptor UFO
Synonyms:
AXL TEL/AXL UFO | UFO_HUMAN
Type:
Enzyme
Mol. Mass.:
98316.97
Organism:
Homo sapiens (Human)
Description:
P30530
Residue:
894
  
Inhibitor
Name:
BDBM313073
Synonyms:
1-(6-phenylthieno[3,2-d]pyrimidin-4-yl)-N3-(4-(2-(pyrrolidin-1-yl)ethoxy)phenyl)-1H-1,2,4-triaozle-3,5-diamine | US10166216, Compound 52
Type:
Small organic molecule
Emp. Form.:
C26H26N8OS
Mol. Mass.:
498.603
SMILES:
Nc1nc(Nc2ccc(OCCN3CCCC3)cc2)nn1-c1ncnc2cc(sc12)-c1ccccc1
: