Target
Tyrosine-protein kinase receptor UFO
Ligand
BDBM313077
Substrate
Meas. Tech.
PHOSPHO-AKT IN-CELL WESTERN ASSAY
IC50
<1000±n/a nM
Citation
 Goff, DZhang, JSylvain, CSingh, RHolland, SYu, JHeckrodt, TJDing, P Substituted triazoles useful as Axl inhibitors US Patent  US10166216 Publication Date 1/1/2019 
Target
Name:
Tyrosine-protein kinase receptor UFO
Synonyms:
AXL TEL/AXL UFO | UFO_HUMAN
Type:
Enzyme
Mol. Mass.:
98316.97
Organism:
Homo sapiens (Human)
Description:
P30530
Residue:
894
  
Inhibitor
Name:
BDBM313077
Synonyms:
1-(benzo[d]thiazol-2-yl)-N3-(3-fluoro-4-(2-(pyrrolidin-1-yl)ethoxy)phenyl)-1H-1,2,4-triazole-3,5-diamine | US10166216, Compound 56
Type:
Small organic molecule
Emp. Form.:
C21H22FN7OS
Mol. Mass.:
439.509
SMILES:
Nc1nc(Nc2ccc(OCCN3CCCC3)c(F)c2)nn1-c1nc2ccccc2s1
: