Target
Tyrosine-protein kinase receptor UFO
Ligand
BDBM313084
Substrate
Meas. Tech.
PHOSPHO-AKT IN-CELL WESTERN ASSAY
IC50
<1000±n/a nM
Citation
 Goff, DZhang, JSylvain, CSingh, RHolland, SYu, JHeckrodt, TJDing, P Substituted triazoles useful as Axl inhibitors US Patent  US10166216 Publication Date 1/1/2019 
Target
Name:
Tyrosine-protein kinase receptor UFO
Synonyms:
AXL TEL/AXL UFO | UFO_HUMAN
Type:
Enzyme
Mol. Mass.:
98316.97
Organism:
Homo sapiens (Human)
Description:
P30530
Residue:
894
  
Inhibitor
Name:
BDBM313084
Synonyms:
1-(6-fluoroquinazolin-4-yl)-N3-(4-(2-(pyrrolidin-1-yl)ethoxy)phenyl)-1H-1,2,4-triazole-3,5-diamine | US10166216, Compound 63
Type:
Small organic molecule
Emp. Form.:
C22H23FN8O
Mol. Mass.:
434.4694
SMILES:
Nc1nc(Nc2ccc(OCCN3CCCC3)cc2)nn1-c1ncnc2ccc(F)cc12
: