Target
Tyrosine-protein kinase receptor UFO
Ligand
BDBM313086
Substrate
Meas. Tech.
PHOSPHO-AKT IN-CELL WESTERN ASSAY
IC50
<1000±n/a nM
Citation
 Goff, DZhang, JSylvain, CSingh, RHolland, SYu, JHeckrodt, TJDing, P Substituted triazoles useful as Axl inhibitors US Patent  US10166216 Publication Date 1/1/2019 
Target
Name:
Tyrosine-protein kinase receptor UFO
Synonyms:
AXL TEL/AXL UFO | UFO_HUMAN
Type:
Enzyme
Mol. Mass.:
98316.97
Organism:
Homo sapiens (Human)
Description:
P30530
Residue:
894
  
Inhibitor
Name:
BDBM313086
Synonyms:
1-(2-methylquinazolin-4-yl)-N3-(4-(2-(pyrrolidin-1-yl)ethoxy)phenyl)-1H-1,2,4-triazole-3,5-diamine | US10166216, Compound 65
Type:
Small organic molecule
Emp. Form.:
C23H26N8O
Mol. Mass.:
430.5055
SMILES:
Cc1nc(-n2nc(Nc3ccc(OCCN4CCCC4)cc3)nc2N)c2ccccc2n1
: