Target
Tyrosine-protein kinase receptor UFO
Ligand
BDBM313151
Substrate
Meas. Tech.
PHOSPHO-AKT IN-CELL WESTERN ASSAY
IC50
<1000±n/a nM
Citation
 Goff, DZhang, JSylvain, CSingh, RHolland, SYu, JHeckrodt, TJDing, P Substituted triazoles useful as Axl inhibitors US Patent  US10166216 Publication Date 1/1/2019 
Target
Name:
Tyrosine-protein kinase receptor UFO
Synonyms:
AXL TEL/AXL UFO | UFO_HUMAN
Type:
Enzyme
Mol. Mass.:
98316.97
Organism:
Homo sapiens (Human)
Description:
P30530
Residue:
894
  
Inhibitor
Name:
BDBM313151
Synonyms:
1-(phenanthridin-6-yl)-N3-(4-(1-methylpiperidin-4-yl)phenyl)-1H-1,2,4-triazole-3,5-diamine | US10166216, Compound 213
Type:
Small organic molecule
Emp. Form.:
C27H27N7
Mol. Mass.:
449.5502
SMILES:
CN1CCC(CC1)c1ccc(Nc2nc(N)n(n2)-c2nc3ccccc3c3ccccc23)cc1
: