Target
Tyrosine-protein kinase receptor UFO
Ligand
BDBM313158
Substrate
Meas. Tech.
PHOSPHO-AKT IN-CELL WESTERN ASSAY
IC50
<1000±n/a nM
Citation
 Goff, DZhang, JSylvain, CSingh, RHolland, SYu, JHeckrodt, TJDing, P Substituted triazoles useful as Axl inhibitors US Patent  US10166216 Publication Date 1/1/2019 
Target
Name:
Tyrosine-protein kinase receptor UFO
Synonyms:
AXL TEL/AXL UFO | UFO_HUMAN
Type:
Enzyme
Mol. Mass.:
98316.97
Organism:
Homo sapiens (Human)
Description:
P30530
Residue:
894
  
Inhibitor
Name:
BDBM313158
Synonyms:
1-(2-chloro-6-methoxy-quinoxalin-3-yl)-N3-(3-fluoro-4-(4-(pyrrolidin-1-yl) piperidin-1-yl)phenyl)-1H-1,2,4-triazole-3,5-diamine | US10166216, Compound 256
Type:
Small organic molecule
Emp. Form.:
C26H29ClFN9O
Mol. Mass.:
538.02
SMILES:
COc1ccc2nc(Cl)c(nc2c1)-n1nc(Nc2ccc(N3CCC(CC3)N3CCCC3)c(F)c2)nc1N
: