Target
Tyrosine-protein kinase receptor UFO
Ligand
BDBM313161
Substrate
Meas. Tech.
PHOSPHO-AKT IN-CELL WESTERN ASSAY
IC50
<1000±n/a nM
Citation
 Goff, DZhang, JSylvain, CSingh, RHolland, SYu, JHeckrodt, TJDing, P Substituted triazoles useful as Axl inhibitors US Patent  US10166216 Publication Date 1/1/2019 
Target
Name:
Tyrosine-protein kinase receptor UFO
Synonyms:
AXL TEL/AXL UFO | UFO_HUMAN
Type:
Enzyme
Mol. Mass.:
98316.97
Organism:
Homo sapiens (Human)
Description:
P30530
Residue:
894
  
Inhibitor
Name:
BDBM313161
Synonyms:
1-(7-methylthieno[3,2-d]pyrimidin-4-yl)-N3-(3-fluoro-4-(4-(2-azabicyclo[2.2.1]heptan-2-yl)piperidin-1-yl)phenyl)-1H-1,2,4-triazole-3,5-diamine | US10166216, Compound 260
Type:
Small organic molecule
Emp. Form.:
C26H30FN9S
Mol. Mass.:
519.64
SMILES:
Cc1csc2c(ncnc12)-n1nc(Nc2ccc(N3CCC(CC3)N3CC4CCC3C4)c(F)c2)nc1N
: