Target
Tyrosine-protein kinase receptor UFO
Ligand
BDBM313162
Substrate
Meas. Tech.
PHOSPHO-AKT IN-CELL WESTERN ASSAY
IC50
<1000±n/a nM
Citation
 Goff, DZhang, JSylvain, CSingh, RHolland, SYu, JHeckrodt, TJDing, P Substituted triazoles useful as Axl inhibitors US Patent  US10166216 Publication Date 1/1/2019 
Target
Name:
Tyrosine-protein kinase receptor UFO
Synonyms:
AXL TEL/AXL UFO | UFO_HUMAN
Type:
Enzyme
Mol. Mass.:
98316.97
Organism:
Homo sapiens (Human)
Description:
P30530
Residue:
894
  
Inhibitor
Name:
BDBM313162
Synonyms:
1-(7-methylthieno[3,2-d]pyrimidin-4-yl)-N3-(4-(1-(bicyclo[2.2.1]heptan-2-yl)piperidin-4-yl) phenyl)-1H-1,2,4-triazole-3,5-diamine | US10166216, Compound 261
Type:
Small organic molecule
Emp. Form.:
C27H32N8S
Mol. Mass.:
500.662
SMILES:
Cc1csc2c(ncnc12)-n1nc(Nc2ccc(cc2)C2CCN(CC2)C2CC3CCC2C3)nc1N
: