Target
Tyrosine-protein kinase receptor UFO
Ligand
BDBM313167
Substrate
Meas. Tech.
PHOSPHO-AKT IN-CELL WESTERN ASSAY
IC50
<1000±n/a nM
Citation
 Goff, DZhang, JSylvain, CSingh, RHolland, SYu, JHeckrodt, TJDing, P Substituted triazoles useful as Axl inhibitors US Patent  US10166216 Publication Date 1/1/2019 
Target
Name:
Tyrosine-protein kinase receptor UFO
Synonyms:
AXL TEL/AXL UFO | UFO_HUMAN
Type:
Enzyme
Mol. Mass.:
98316.97
Organism:
Homo sapiens (Human)
Description:
P30530
Residue:
894
  
Inhibitor
Name:
BDBM313167
Synonyms:
1-(7-methyl-2-chlorothieno[3,2-d] pyrimidin-4-yl)-N3-(7-pyrrolidin-1-yl-6,7,8,9-tetrahydro-5H-benzo[7] annulene-2-yl)-1H-1,2,4-triazole-3,5-diamine | US10166216, Compound 219
Type:
Small organic molecule
Emp. Form.:
C24H27ClN8S
Mol. Mass.:
495.043
SMILES:
Cc1csc2c(nc(Cl)nc12)-n1nc(Nc2ccc3CCC(CCc3c2)N2CCCC2)nc1N
: