Target
Tyrosine-protein kinase receptor UFO
Ligand
BDBM313168
Substrate
Meas. Tech.
PHOSPHO-AKT IN-CELL WESTERN ASSAY
IC50
<1000±n/a nM
Citation
 Goff, DZhang, JSylvain, CSingh, RHolland, SYu, JHeckrodt, TJDing, P Substituted triazoles useful as Axl inhibitors US Patent  US10166216 Publication Date 1/1/2019 
Target
Name:
Tyrosine-protein kinase receptor UFO
Synonyms:
AXL TEL/AXL UFO | UFO_HUMAN
Type:
Enzyme
Mol. Mass.:
98316.97
Organism:
Homo sapiens (Human)
Description:
P30530
Residue:
894
  
Inhibitor
Name:
BDBM313168
Synonyms:
1-(6,7-dimethoxy-quinazolin-4-yl)-N3-(7-pyrrolidin-1-yl-6,7,8,9-tetrahydro-5H-benzo[7] annulene-2-yl)-1H-1,2,4-triazole-3,5-diamine | US10166216, Compound 220
Type:
Small organic molecule
Emp. Form.:
C27H32N8O2
Mol. Mass.:
500.5954
SMILES:
COc1cc2ncnc(-n3nc(Nc4ccc5CCC(CCc5c4)N4CCCC4)nc3N)c2cc1OC
: