Target
Tyrosine-protein kinase receptor UFO
Ligand
BDBM313169
Substrate
Meas. Tech.
PHOSPHO-AKT IN-CELL WESTERN ASSAY
IC50
<1000±n/a nM
Citation
 Goff, DZhang, JSylvain, CSingh, RHolland, SYu, JHeckrodt, TJDing, P Substituted triazoles useful as Axl inhibitors US Patent  US10166216 Publication Date 1/1/2019 
Target
Name:
Tyrosine-protein kinase receptor UFO
Synonyms:
AXL TEL/AXL UFO | UFO_HUMAN
Type:
Enzyme
Mol. Mass.:
98316.97
Organism:
Homo sapiens (Human)
Description:
P30530
Residue:
894
  
Inhibitor
Name:
BDBM313169
Synonyms:
1-(7-methyl-2-chlorothieno[3,2-d] pyrimidin-4-yl)-N3-(7-(N-methyl-N-bicyclo[2.2.1] heptan-2-yl)amino-6,7,8,9-tetrahydro-5H-benzo[7]annulene-2-yl)-1H-1,2,4-triazole-3,5-diamine | US10166216, Compound 221
Type:
Small organic molecule
Emp. Form.:
C28H33ClN8S
Mol. Mass.:
549.133
SMILES:
CN(C1CC2CCC1C2)C1CCc2ccc(Nc3nc(N)n(n3)-c3nc(Cl)nc4c(C)csc34)cc2CC1
: