Target
Tyrosine-protein kinase receptor UFO
Ligand
BDBM313171
Substrate
Meas. Tech.
PHOSPHO-AKT IN-CELL WESTERN ASSAY
IC50
<1000±n/a nM
Citation
 Goff, DZhang, JSylvain, CSingh, RHolland, SYu, JHeckrodt, TJDing, P Substituted triazoles useful as Axl inhibitors US Patent  US10166216 Publication Date 1/1/2019 
Target
Name:
Tyrosine-protein kinase receptor UFO
Synonyms:
AXL TEL/AXL UFO | UFO_HUMAN
Type:
Enzyme
Mol. Mass.:
98316.97
Organism:
Homo sapiens (Human)
Description:
P30530
Residue:
894
  
Inhibitor
Name:
BDBM313171
Synonyms:
1-(6,7-dimethoxyquinazolin-4-yl)-N3-(7-(N-bicyclo[2.2.1]heptan-2-yl)amino-6,7,8,9-tetrahydro-5H-benzo[7]annulene-2-yl)-1H-1,2,4-triazole-3,5-diamine | US10166216, Compound 223
Type:
Small organic molecule
Emp. Form.:
C30H36N8O2
Mol. Mass.:
540.6592
SMILES:
COc1cc2ncnc(-n3nc(Nc4ccc5CCC(CCc5c4)NC4CC5CCC4C5)nc3N)c2cc1OC
: