Target
Sphingosine-1-phosphate lyase 1
Ligand
BDBM65084
Substrate
Meas. Tech.
S1P1 Binding Assay
IC50
<10±n/a nM
Citation
 Dyckman, AJDhar, TGXiao, HGilmore, JLYang, MGXiao, ZMarcoux, D Substituted bicyclic compounds US Patent  US10166249 Publication Date 1/1/2019 
Target
Name:
Sphingosine-1-phosphate lyase 1
Synonyms:
KIAA1252 SGPL1 SP-lyase 1 Sphingosine-1-phosphate aldolase | hSPL
Type:
PROTEIN
Mol. Mass.:
63546.76
Organism:
Homo sapiens (Human)
Description:
ChEMBL_108363
Residue:
568
  
Inhibitor
Name:
BDBM65084
Synonyms:
US10166249, Example 450 | US9522888, 450
Type:
Emp. Form.:
C27H46NO5P
Mol. Mass.:
495.6316
SMILES:
CCCCCCCCCCOC[C@H]1CCc2cc(ccc2C1)[C@H]1CC[C@](N)(COP(O)(O)=O)C1
: