Target
Sphingosine-1-phosphate lyase 1
Ligand
BDBM65133
Substrate
Meas. Tech.
S1P1 Binding Assay
IC50
<10±n/a nM
Citation
 Dyckman, AJDhar, TGXiao, HGilmore, JLYang, MGXiao, ZMarcoux, D Substituted bicyclic compounds US Patent  US10166249 Publication Date 1/1/2019 
Target
Name:
Sphingosine-1-phosphate lyase 1
Synonyms:
KIAA1252 SGPL1 SP-lyase 1 Sphingosine-1-phosphate aldolase | hSPL
Type:
PROTEIN
Mol. Mass.:
63546.76
Organism:
Homo sapiens (Human)
Description:
ChEMBL_108363
Residue:
568
  
Inhibitor
Name:
BDBM65133
Synonyms:
US10166249, Example 490 | US9522888, 490
Type:
Emp. Form.:
C26H37N2O5P
Mol. Mass.:
488.5561
SMILES:
CN(C)Cc1cccc(OC[C@@H]2CCc3cc(ccc3C2)[C@H]2CC[C@](N)(COP(O)(O)=O)C2)c1
: