Target
Sphingosine-1-phosphate lyase 1
Ligand
BDBM65145
Substrate
Meas. Tech.
S1P1 Binding Assay
IC50
<10±n/a nM
Citation
 Dyckman, AJDhar, TGXiao, HGilmore, JLYang, MGXiao, ZMarcoux, D Substituted bicyclic compounds US Patent  US10166249 Publication Date 1/1/2019 
Target
Name:
Sphingosine-1-phosphate lyase 1
Synonyms:
KIAA1252 SGPL1 SP-lyase 1 Sphingosine-1-phosphate aldolase | hSPL
Type:
PROTEIN
Mol. Mass.:
63546.76
Organism:
Homo sapiens (Human)
Description:
ChEMBL_108363
Residue:
568
  
Inhibitor
Name:
BDBM65145
Synonyms:
US10166249, Example 499 | US9522888, 499
Type:
Emp. Form.:
C23H29F3NO5PS
Mol. Mass.:
519.514
SMILES:
N[C@]1(COP(O)(O)=O)CC[C@@H](C1)c1ccc2C[C@H](COCc3ccc(s3)C(F)(F)F)CCc2c1
: