Target
RAF proto-oncogene serine/threonine-protein kinase
Ligand
BDBM313548
Substrate
Meas. Tech.
In Vitro Raf Activity Determination
IC50
1992±n/a nM
Citation
 Aversa, RJBurger, MTDillon, MPDineen, Jr., TALou, YNishiguchi, GARamurthy, SRico, ACRauniyar, VSendzik, MSubramanian, SSetti, LQTaft, BRTanner, HRWan, L Compounds and compositions as RAF kinase inhibitors US Patent  US10167279 Publication Date 1/1/2019 
Target
Name:
RAF proto-oncogene serine/threonine-protein kinase
Synonyms:
C-Raf Protein Kinase RAF RAF1 Raf-1 Serine/threonine-protein kinase C-Raf | cRaf
Type:
Serine/threonine-protein kinase
Mol. Mass.:
73082.52
Organism:
Homo sapiens (Human)
Description:
P04049
Residue:
648
  
Inhibitor
Name:
BDBM313548
Synonyms:
N-(3-(2-((2- hydroxyethyl)amino)-6- (tetrahydro-2H-pyran-4- yl)pyridin-4-yl)-4- methylphenyl)-2- (trifluoromethyl) isonicotinamide | US10167279, Example 172
Type:
Small organic molecule
Emp. Form.:
C26H27F3N4O3
Mol. Mass.:
500.5128
SMILES:
Cc1ccc(NC(=O)c2ccnc(c2)C(F)(F)F)cc1-c1cc(NCCO)nc(c1)C1CCOCC1
: