Target
Bromodomain-containing protein 3 [51-123]
Ligand
BDBM313771
Substrate
Meas. Tech.
Binding Assay
IC50
<100±n/a nM
Citation
 Burns, CGarnier, JSharp, PPFeutrill, JCuzzupe, A Benzodiazepines as bromodomain inhibitors US Patent  US10167292 Publication Date 1/1/2019 
Target
Name:
Bromodomain-containing protein 3 [51-123]
Synonyms:
BRD3 Bromodomain-containing protein 3 (BRD3)(BD1) KIAA0043 | RING3L
Type:
Mol. Mass.:
8887.10
Organism:
Homo sapiens (Human)
Description:
BD1 (51-123 aa) of Q15059
Residue:
73
  
Inhibitor
Name:
BDBM313771
Synonyms:
US10167292, Example 5
Type:
Small organic molecule
Emp. Form.:
C17H16N4
Mol. Mass.:
276.3357
SMILES:
Cc1nnn2CCN(c3ccccc3)c3ccccc3-c12
: