Target
Acetylcholinesterase
Ligand
BDBM10520
Substrate
BDBM8959
Meas. Tech.
Measurement of FBSAChE/EqBuChE Inhibitory Activity
pH
8±n/a
Temperature
298.15±n/a K
Ki
>10000±n/a nM
Citation
 Savini, LCampiani, GGaeta, APellerano, CFattorusso, CChiasserini, LFedorko, JMSaxena, A Novel and potent tacrine-related hetero- and homobivalent ligands for acetylcholinesterase and butyrylcholinesterase. Bioorg Med Chem Lett 11:1779-82 (2001)  
Target
Name:
Acetylcholinesterase
Synonyms:
ACES_HUMAN Acetylcholinesterase (AChE) | Acetylcholinesterase (human AChE)
Type:
Enzyme
Mol. Mass.:
67792.70
Organism:
Homo sapiens (Human)
Description:
P22303
Residue:
614
  
Inhibitor
Name:
BDBM10520
Synonyms:
9-{[7-(1,2,3,4-tetrahydroacridin-9-ylsulfanyl)heptyl]sulfanyl}-1,2,3,4-tetrahydroacridine | tacrine homobivalent compound 3d
Type:
Small organic molecule
Emp. Form.:
C33H38N2S2
Mol. Mass.:
526.798
SMILES:
C(CCCSc1c2CCCCc2nc2ccccc12)CCCSc1c2CCCCc2nc2ccccc12
:
Substrate
Name:
BDBM8959
Synonyms:
(2-Mercaptoethyl)trimethylammonium iodide acetate Acetylthiocholine acetylthiocholine chloride | acetylthiocholine iodide
Type:
Small organic molecule
Emp. Form.:
C7H16NOS
Mol. Mass.:
162.272
SMILES:
CC(=O)SCC[N+](C)(C)C
: