Target
Acetylcholinesterase
Ligand
BDBM10523
Substrate
BDBM8959
Meas. Tech.
Measurement of FBSAChE/EqBuChE Inhibitory Activity
pH
8±n/a
Temperature
298.15±n/a K
Ki
41±n/a nM
Citation
 Savini, LCampiani, GGaeta, APellerano, CFattorusso, CChiasserini, LFedorko, JMSaxena, A Novel and potent tacrine-related hetero- and homobivalent ligands for acetylcholinesterase and butyrylcholinesterase. Bioorg Med Chem Lett 11:1779-82 (2001)  
Target
Name:
Acetylcholinesterase
Synonyms:
ACES_HUMAN Acetylcholinesterase (AChE) | Acetylcholinesterase (human AChE)
Type:
Enzyme
Mol. Mass.:
67792.70
Organism:
Homo sapiens (Human)
Description:
P22303
Residue:
614
  
Inhibitor
Name:
BDBM10523
Synonyms:
6,8-dichloro-N-[7-(1,2,3,4-tetrahydroacridin-9-ylsulfanyl)heptyl]-1,2,3,4-tetrahydroacridin-9-amine | tacrine heterobivalent compound 3g
Type:
Small organic molecule
Emp. Form.:
C33H37Cl2N3S
Mol. Mass.:
578.638
SMILES:
Clc1cc(Cl)c2c(NCCCCCCCSc3c4CCCCc4nc4ccccc34)c3CCCCc3nc2c1
:
Substrate
Name:
BDBM8959
Synonyms:
(2-Mercaptoethyl)trimethylammonium iodide acetate Acetylthiocholine acetylthiocholine chloride | acetylthiocholine iodide
Type:
Small organic molecule
Emp. Form.:
C7H16NOS
Mol. Mass.:
162.272
SMILES:
CC(=O)SCC[N+](C)(C)C
: