Target
Carboxylic ester hydrolase
Ligand
BDBM10523
Substrate
BDBM8978
Meas. Tech.
Measurement of FBSAChE/EqBuChE Inhibitory Activity
pH
8±n/a
Temperature
298.15±n/a K
Ki
250±n/a nM
Citation
 Savini, LCampiani, GGaeta, APellerano, CFattorusso, CChiasserini, LFedorko, JMSaxena, A Novel and potent tacrine-related hetero- and homobivalent ligands for acetylcholinesterase and butyrylcholinesterase. Bioorg Med Chem Lett 11:1779-82 (2001)  
Target
Name:
Carboxylic ester hydrolase
Synonyms:
BuChE Butyrylcholine esterase Butyrylcholinesterase (BChE) Butyrylcholinesterase (EqBuChE) butyrylcholinesterase precursor
Type:
Protein
Mol. Mass.:
68842.83
Organism:
Equus caballus (Horse)
Description:
Q9N1N9
Residue:
602
  
Inhibitor
Name:
BDBM10523
Synonyms:
6,8-dichloro-N-[7-(1,2,3,4-tetrahydroacridin-9-ylsulfanyl)heptyl]-1,2,3,4-tetrahydroacridin-9-amine | tacrine heterobivalent compound 3g
Type:
Small organic molecule
Emp. Form.:
C33H37Cl2N3S
Mol. Mass.:
578.638
SMILES:
Clc1cc(Cl)c2c(NCCCCCCCSc3c4CCCCc4nc4ccccc34)c3CCCCc3nc2c1
:
Substrate
Name:
BDBM8978
Synonyms:
(Propylcarbonylthioethyl)trimethylammonium iodide CHEMBL148530 butyrylthiocholine | butyrylthiocholine chloride
Type:
Small organic molecule
Emp. Form.:
C9H20NOS
Mol. Mass.:
190.326
SMILES:
CCCC(=O)SCC[N+](C)(C)C
: