Target
Sigma non-opioid intracellular receptor 1
Ligand
BDBM50077877
Substrate
Meas. Tech.
Binding Assay
Ki
4.80±n/a nM
Citation
 Torrens-Jover, AChristmann, UDiaz-Fernández, JAlmansa-Rosales, C 1,2,3-triazole-4-amine derivatives for the treatment of sigma receptor related diseases and disorders US Patent  US9611229 Publication Date 4/4/2017 
Target
Name:
Sigma non-opioid intracellular receptor 1
Synonyms:
Opioid receptor, sigma 1 SGMR1_MOUSE Sigma1-receptor Sigmar1
Type:
Enzyme Catalytic Domain
Mol. Mass.:
25246.51
Organism:
Mus musculus (Mouse)
Description:
O55242
Residue:
223
  
Inhibitor
Name:
BDBM50077877
Synonyms:
CHEMBL3417042 | US9611229, 2
Type:
Small organic molecule
Emp. Form.:
C15H19Cl2N5
Mol. Mass.:
340.251
SMILES:
Clc1ccc(cc1Cl)-n1cc(NCCN2CCCCC2)nn1
: