Target
Sigma non-opioid intracellular receptor 1
Ligand
BDBM50077888
Substrate
Meas. Tech.
Binding Assay
Ki
35.4±n/a nM
Citation
 Torrens-Jover, AChristmann, UDiaz-Fernández, JAlmansa-Rosales, C 1,2,3-triazole-4-amine derivatives for the treatment of sigma receptor related diseases and disorders US Patent  US9611229 Publication Date 4/4/2017 
Target
Name:
Sigma non-opioid intracellular receptor 1
Synonyms:
Opioid receptor, sigma 1 SGMR1_MOUSE Sigma1-receptor Sigmar1
Type:
Enzyme Catalytic Domain
Mol. Mass.:
25246.51
Organism:
Mus musculus (Mouse)
Description:
O55242
Residue:
223
  
Inhibitor
Name:
BDBM50077888
Synonyms:
CHEMBL3417060 | US9611229, 18
Type:
Small organic molecule
Emp. Form.:
C16H22FN5
Mol. Mass.:
303.3778
SMILES:
Fc1cccc(Cn2cc(NCCN3CCCCC3)nn2)c1
: