Target
Sigma non-opioid intracellular receptor 1
Ligand
BDBM314376
Substrate
Meas. Tech.
Binding Assay
Ki
62.5±n/a nM
Citation
 Torrens-Jover, AChristmann, UDiaz-Fernández, JAlmansa-Rosales, C 1,2,3-triazole-4-amine derivatives for the treatment of sigma receptor related diseases and disorders US Patent  US9611229 Publication Date 4/4/2017 
Target
Name:
Sigma non-opioid intracellular receptor 1
Synonyms:
Opioid receptor, sigma 1 SGMR1_MOUSE Sigma1-receptor Sigmar1
Type:
Enzyme Catalytic Domain
Mol. Mass.:
25246.51
Organism:
Mus musculus (Mouse)
Description:
O55242
Residue:
223
  
Inhibitor
Name:
BDBM314376
Synonyms:
1-cyclohexyl-N-(2-(4- cyclohexylpiperazin- 1-yl)ethyl)-1H-1,2,3- triazol-4-amine hydrochloride | US9611229, 30
Type:
Small organic molecule
Emp. Form.:
C20H36N6
Mol. Mass.:
360.54
SMILES:
C(CN1CCN(CC1)C1CCCCC1)Nc1cn(nn1)C1CCCCC1
: