Target
Sigma non-opioid intracellular receptor 1
Ligand
BDBM50077883
Substrate
Meas. Tech.
Binding Assay
Ki
36.3±n/a nM
Citation
 Torrens-Jover, AChristmann, UDiaz-Fernández, JAlmansa-Rosales, C 1,2,3-triazole-4-amine derivatives for the treatment of sigma receptor related diseases and disorders US Patent  US9611229 Publication Date 4/4/2017 
Target
Name:
Sigma non-opioid intracellular receptor 1
Synonyms:
Opioid receptor, sigma 1 SGMR1_MOUSE Sigma1-receptor Sigmar1
Type:
Enzyme Catalytic Domain
Mol. Mass.:
25246.51
Organism:
Mus musculus (Mouse)
Description:
O55242
Residue:
223
  
Inhibitor
Name:
BDBM50077883
Synonyms:
CHEMBL3417054 | US9611229, 32
Type:
Small organic molecule
Emp. Form.:
C15H20FN5O
Mol. Mass.:
305.3506
SMILES:
Fc1cccc(c1)-n1cc(NCCN2CCCOCC2)nn1
: