Target
Sigma non-opioid intracellular receptor 1
Ligand
BDBM314392
Substrate
Meas. Tech.
Binding Assay
Ki
71.5±n/a nM
Citation
 Torrens-Jover, AChristmann, UDiaz-Fernández, JAlmansa-Rosales, C 1,2,3-triazole-4-amine derivatives for the treatment of sigma receptor related diseases and disorders US Patent  US9611229 Publication Date 4/4/2017 
Target
Name:
Sigma non-opioid intracellular receptor 1
Synonyms:
Opioid receptor, sigma 1 SGMR1_MOUSE Sigma1-receptor Sigmar1
Type:
Enzyme Catalytic Domain
Mol. Mass.:
25246.51
Organism:
Mus musculus (Mouse)
Description:
O55242
Residue:
223
  
Inhibitor
Name:
BDBM314392
Synonyms:
N-(1-(1- adamantyl)-1H- 1,2,3-triazol-4- yl)-N-(2- morpholinoethyl) acetamide hydrochloride | US9611229, 57
Type:
Small organic molecule
Emp. Form.:
C20H31N5O2
Mol. Mass.:
373.4924
SMILES:
CC(=O)N(CCN1CCOCC1)c1cn(nn1)C12CC3CC(CC(C3)C1)C2
: