Target
Acetylcholinesterase
Ligand
BDBM10608
Substrate
BDBM8959
Meas. Tech.
Cholinesterase Inhibition Assay
pH
8±n/a
Temperature
310.15±n/a K
IC50
28±2 nM
Citation
 Luo, WYu, QSKulkarni, SSParrish, DAHolloway, HWTweedie, DShafferman, ALahiri, DKBrossi, AGreig, NH Inhibition of human acetyl- and butyrylcholinesterase by novel carbamates of (-)- and (+)-tetrahydrofurobenzofuran and methanobenzodioxepine. J Med Chem 49:2174-85 (2006)  
Target
Name:
Acetylcholinesterase
Synonyms:
ACES_HUMAN Acetylcholinesterase (AChE) | Acetylcholinesterase (human AChE)
Type:
Enzyme
Mol. Mass.:
67792.70
Organism:
Homo sapiens (Human)
Description:
P22303
Residue:
614
  
Inhibitor
Name:
BDBM10608
Synonyms:
(-)-physostigmine CHEMBL306319 Physostigmine Carbamate 15a
Type:
Small organic molecule
Emp. Form.:
C15H21N3O2
Mol. Mass.:
275.3461
SMILES:
CNC(=O)Oc1ccc2N(C)C3N(C)CC[C@@]3(C)c2c1
:
Substrate
Name:
BDBM8959
Synonyms:
(2-Mercaptoethyl)trimethylammonium iodide acetate Acetylthiocholine acetylthiocholine chloride | acetylthiocholine iodide
Type:
Small organic molecule
Emp. Form.:
C7H16NOS
Mol. Mass.:
162.272
SMILES:
CC(=O)SCC[N+](C)(C)C
: