Target
cGMP-dependent 3',5'-cyclic phosphodiesterase
Ligand
BDBM50444038
Substrate
Meas. Tech.
In Vitro Assay PDE2A
pH
7.8±n/a
Temperature
298.15±n/a K
IC50
1.40±n/a nM
Comments
extracted
Citation
 Megens, AALanglois, XJAndrés-Gil, JI Combinations comprising PDE 2 inhibitors such as 1-aryl-4-methyl-[1,2,4]triazolo-[4,3-A]]quinoxaline compounds and PDE 10 inhibitors for use in the treatment of neurological of metabolic disorders US Patent  US9669035 Publication Date 6/6/2017 
Target
Name:
cGMP-dependent 3',5'-cyclic phosphodiesterase
Synonyms:
CGS-PDE Homo sapiens phosphodiesterase 2A (PDE2A) PDE2A cGSPDE
Type:
Enzyme Catalytic Domain
Mol. Mass.:
105691.58
Organism:
Homo sapiens (Human)
Description:
O00408
Residue:
941
  
Inhibitor
Name:
BDBM50444038
Synonyms:
CHEMBL3092563 | US9669035, B-5
Type:
Small organic molecule
Emp. Form.:
C21H19ClFN5O
Mol. Mass.:
411.86
SMILES:
Cc1nc2ccc(CN3CCOCC3)cc2n2c(nnc12)-c1c(F)cccc1Cl
: