Target
cGMP-dependent 3',5'-cyclic phosphodiesterase
Ligand
BDBM179972
Substrate
Meas. Tech.
In Vitro Assay PDE2A
pH
7.8±n/a
Temperature
298.15±n/a K
IC50
11±n/a nM
Comments
extracted
Citation
 Megens, AALanglois, XJAndrés-Gil, JI Combinations comprising PDE 2 inhibitors such as 1-aryl-4-methyl-[1,2,4]triazolo-[4,3-A]]quinoxaline compounds and PDE 10 inhibitors for use in the treatment of neurological of metabolic disorders US Patent  US9669035 Publication Date 6/6/2017 
Target
Name:
cGMP-dependent 3',5'-cyclic phosphodiesterase
Synonyms:
CGS-PDE Homo sapiens phosphodiesterase 2A (PDE2A) PDE2A cGSPDE
Type:
Enzyme Catalytic Domain
Mol. Mass.:
105691.58
Organism:
Homo sapiens (Human)
Description:
O00408
Residue:
941
  
Inhibitor
Name:
BDBM179972
Synonyms:
US9669035, B-11
Type:
Small organic molecule
Emp. Form.:
C23H26ClN5O
Mol. Mass.:
423.938
SMILES:
CCCCOc1ccc(Cl)c(c1)-c1nnc2c(C)nc3ccc(CN(C)C)cc3n12
: