Target
cGMP-dependent 3',5'-cyclic phosphodiesterase
Ligand
BDBM182858
Substrate
Meas. Tech.
In Vitro Assay PDE2A
pH
7.8±n/a
Temperature
298.15±n/a K
IC50
350±n/a nM
Comments
extracted
Citation
 Megens, AALanglois, XJAndrés-Gil, JI Combinations comprising PDE 2 inhibitors such as 1-aryl-4-methyl-[1,2,4]triazolo-[4,3-A]]quinoxaline compounds and PDE 10 inhibitors for use in the treatment of neurological of metabolic disorders US Patent  US9669035 Publication Date 6/6/2017 
Target
Name:
cGMP-dependent 3',5'-cyclic phosphodiesterase
Synonyms:
CGS-PDE Homo sapiens phosphodiesterase 2A (PDE2A) PDE2A cGSPDE
Type:
Enzyme Catalytic Domain
Mol. Mass.:
105691.58
Organism:
Homo sapiens (Human)
Description:
O00408
Residue:
941
  
Inhibitor
Name:
BDBM182858
Synonyms:
US9669035, B-32
Type:
Small organic molecule
Emp. Form.:
C22H24N6O
Mol. Mass.:
388.4656
SMILES:
CCNCc1ccc2nc(C)c3nnc(-c4cncc(OCC5CC5)c4)n3c2c1
: