Target
Cholinesterase
Ligand
BDBM10680
Substrate
BDBM8978
Meas. Tech.
Cholinesterase Inhibition Assay
IC50
952±n/a nM
Citation
 Yu, QGreig, NHHolloway, HWBrossi, A Syntheses and anticholinesterase activities of (3aS)-N1, N8-bisnorphenserine, (3aS)-N1,N8-bisnorphysostigmine, their antipodal isomers, and other potential metabolites of phenserine. J Med Chem 41:2371-9 (1998)  
Target
Name:
Cholinesterase
Synonyms:
Acylcholine acylhydrolase Butyrylcholine esterase (BChE) Butyrylcholinesterase (BuChE) CHLE_HUMAN Cholinesterases Pseudocholinesterase
Type:
Homotetramer
Mol. Mass.:
68422.27
Organism:
Homo sapiens (Human)
Description:
P06276
Residue:
602
  
Inhibitor
Name:
BDBM10680
Synonyms:
(+)-N1,N8-bisnorphenserine (3aR)-3a-methyl-1H,2H,3H,3aH,8H,8aH-pyrrolo[2,3-b]indol-5-yl N-phenylcarbamate
Type:
Small organic molecule
Emp. Form.:
C18H19N3O2
Mol. Mass.:
309.3624
SMILES:
C[C@]12CCNC1Nc1ccc(OC(=O)Nc3ccccc3)cc21
:
Substrate
Name:
BDBM8978
Synonyms:
(Propylcarbonylthioethyl)trimethylammonium iodide CHEMBL148530 butyrylthiocholine | butyrylthiocholine chloride
Type:
Small organic molecule
Emp. Form.:
C9H20NOS
Mol. Mass.:
190.326
SMILES:
CCCC(=O)SCC[N+](C)(C)C
: