Target
Potassium voltage-gated channel subfamily H member 2
Ligand
BDBM315663
Substrate
Meas. Tech.
Kv11.1 (hERG) ION CHANNEL ACTIVITY (Patch Clamp Assay)
Ki
20000±n/a nM
Citation
 Fuchss, TEmde, UBuchstaller, HMederski, W Arylquinazolines US Patent  US10172859 Publication Date 1/8/2019 
Target
Name:
Potassium voltage-gated channel subfamily H member 2
Synonyms:
1,3-beta-glucan synthase component GLS2 ERG Eag-related protein 1 Ether-a-go-go-related gene (HERG) Ether-a-go-go-related gene potassium channel 1 Ether-a-go-go-related gene potassium channel 1 (hERG1) Ether-a-go-go-related protein 1 H-ERG KCNH2 Potassium voltage-gated channel subfamily H member 2 (hERG) Voltage-gated potassium channel subunit Kv11.1 hERG Potassium Channel 1 | putative potassium channel subunit
Type:
Multi-pass membrane protein
Mol. Mass.:
126672.65
Organism:
Homo sapiens (Human)
Description:
Q12809
Residue:
1159
  
Inhibitor
Name:
BDBM315663
Synonyms:
US10172859, Example 88 US9732094, Example 88 | [2,4-Difluoro-5-(7- morpholin-4-yl- quinazolin-4-yl)- phenyl]-(3,6-dimethyl- pyrazin-2-yl)methanol1H NMR (400 MHz, DMSO-d6) ppm = 9.13 (s, 1H), 8.35 (s, 1H), 7.88 (t, J = 8.2, 1H), 7.61 (dd, J = 9.4, 3.0, 1H), 7.56 (dd, J = 9.5, 2.5, 1H), 7.42 (t, J = 10.2, 1H), 7.23 (d, J = 2.4, 1H), 6.31 (d, J = 5.9, 1H), 6.22 (d, J = 5.6, 1H), 3.85-3.75 (m, 4H), 3.51-3.43 (m, 4H), 2.58 (s, 3H), 2.40 (s, 3H).
Type:
Small organic molecule
Emp. Form.:
C25H23F2N5O2
Mol. Mass.:
463.4792
SMILES:
Cc1cnc(C)c(n1)C(O)c1cc(c(F)cc1F)-c1ncnc2cc(ccc12)N1CCOCC1
: