Target
Myeloperoxidase
Ligand
BDBM312261
Substrate
Meas. Tech.
Inhibitory Activity
IC50
24.0±n/a nM
Citation
 Inghardt, TBJohannesson, PJurva, ULindstedt-Alstermark, ETomkinson, NStonehouse, JP 1-[2-(aminomethyl)benzyl]-2-thioxo-1,2,3,5-tetrahydro-4H-pyrrolo[3,2-d]pyrimidin-4-ones as inhibitors of myeloperoxidase US Patent  US9616063 Publication Date 4/11/2017 
Target
Name:
Myeloperoxidase
Synonyms:
84 kDa myeloperoxidase MPO Myeloperoxidase Myeloperoxidase heavy chain PERM_HUMAN
Type:
Enzyme
Mol. Mass.:
83888.32
Organism:
Homo sapiens (Human)
Description:
P05164
Residue:
745
  
Inhibitor
Name:
BDBM312261
Synonyms:
1-{2-[(Propan-2-ylamino)methyl]benzyl}-2-thioxo-1,2,3,5-tetrahydro-4H-pyrrolo[3,2-d]pyrimidin-4-one US11000525, Example 13 | US9616063, 13
Type:
Small organic molecule
Emp. Form.:
C17H20N4OS
Mol. Mass.:
328.432
SMILES:
CC(C)NCc1ccccc1Cn1c2cc[nH]c2c(=O)[nH]c1=S
: