Target
Vascular endothelial growth factor receptor 2
Ligand
BDBM316140
Substrate
Meas. Tech.
Kinase Inhibition Assay
IC50
5.80±n/a nM
Citation
 Takeda, NMiyabe, TMachida, SMachida, MNakajima, T Alkynyl indazole derivative and use thereof US Patent  US9617222 Publication Date 4/11/2017 
Target
Name:
Vascular endothelial growth factor receptor 2
Synonyms:
CD_antigen=CD309 Fetal liver kinase 1 (FLK-1) KDR Protein-tyrosine kinase receptor Flk-1 VEGFR-2 VEGFR2 Vascular Endothelial Growth Factor Receptor Kinase 2 Vascular endothelial growth factor receptor 2 (KDR) Vascular endothelial growth factor receptor 2 (VEGFR2) Vascular endothelial growth factor receptor-2 (VEGFR-2)
Type:
Receptor Tyrosine Kinase
Mol. Mass.:
151510.97
Organism:
Homo sapiens (Human)
Description:
P35968
Residue:
1356
  
Inhibitor
Name:
BDBM316140
Synonyms:
2-(2-methoxyethoxy)ethyl {4-[(6-{[2-(methylcarbamoyl)phenyl]thio}-1H-indazol-3-yl)ethynyl]phenyl}carbamate | US9617222, Compound 15
Type:
Small organic molecule
Emp. Form.:
C29H28N4O5S
Mol. Mass.:
544.621
SMILES:
CNC(=O)c1ccccc1Sc1ccc2c(n[nH]c2c1)C#Cc1ccc(NC(=O)OCCOCCOC)cc1
: