Target
Tyrosine-protein kinase BTK
Ligand
BDBM316860
Substrate
Meas. Tech.
TR-FRET (Time Resolved FRET) Assay
IC50
114±n/a nM
Citation
 Chin, EWeikert, RJYun, WZhang, J Inhibitors of bruton's tyrosine kinase US Patent  US9617260 Publication Date 4/11/2017 
Target
Name:
Tyrosine-protein kinase BTK
Synonyms:
AGMX1 Agammaglobulinaemia tyrosine kinase B cell progenitor kinase BPK BTK_HUMAN Tyrosine Kinase BTK Tyrosine-protein kinase BTK (BTK)
Type:
Enzyme
Mol. Mass.:
76289.95
Organism:
Homo sapiens (Human)
Description:
Q06187
Residue:
659
  
Inhibitor
Name:
BDBM316860
Synonyms:
(3- cyanophenyl) methyl N-[3-[3- (2- oxobutanoylamino) phenyl]-1H- pyrrolo[2,3- b]pyridin-5- yl]carbamate | US9617260, Compound 19
Type:
Small organic molecule
Emp. Form.:
C26H21N5O4
Mol. Mass.:
467.476
SMILES:
CCC(=O)C(=O)Nc1cccc(c1)-c1c[nH]c2ncc(NC(=O)OCc3cccc(c3)C#N)cc12
: