Target
Dual specificity protein kinase CLK2
Ligand
BDBM317456
Substrate
Meas. Tech.
Radioactivity Based Kinase Assay
IC50
34.9±n/a nM
Citation
 Zhu, DBoylan, JXu, SRiggs, JShi, TWurmser, AMikolon, DDeyanat-Yazdi, G Methods of treating a cancer using substituted pyrrolopyrimidine compounds, compositions thereof US Patent  US9623028 Publication Date 4/18/2017 
Target
Name:
Dual specificity protein kinase CLK2
Synonyms:
2.7.12.1 CDC-like kinase 2 (CLK2) CLK2 | CLK2_HUMAN
Type:
Mol. Mass.:
60128.79
Organism:
Homo sapiens (Human)
Description:
P49760
Residue:
499
  
Inhibitor
Name:
BDBM317456
Synonyms:
4-(4-(cyclopentyloxy)-5-(4- hydroxyphenyl)-7H-pyrrolo[2,3- d]pyrimidin-2-ylamino)-3- isopropyl-N-methylbenzamide | US9623028, Compound 11
Type:
Small organic molecule
Emp. Form.:
C28H31N5O3
Mol. Mass.:
485.5774
SMILES:
CNC(=O)c1ccc(Nc2nc(OC3CCCC3)c3c(c[nH]c3n2)-c2ccc(O)cc2)c(c1)C(C)C
: