Target
Dual specificity protein kinase CLK2
Ligand
BDBM317458
Substrate
Meas. Tech.
Radioactivity Based Kinase Assay
IC50
26.0±n/a nM
Citation
 Zhu, DBoylan, JXu, SRiggs, JShi, TWurmser, AMikolon, DDeyanat-Yazdi, G Methods of treating a cancer using substituted pyrrolopyrimidine compounds, compositions thereof US Patent  US9623028 Publication Date 4/18/2017 
Target
Name:
Dual specificity protein kinase CLK2
Synonyms:
2.7.12.1 CDC-like kinase 2 (CLK2) CLK2 | CLK2_HUMAN
Type:
Mol. Mass.:
60128.79
Organism:
Homo sapiens (Human)
Description:
P49760
Residue:
499
  
Inhibitor
Name:
BDBM317458
Synonyms:
4-(4-(cyclopentylamino)-5-(4- hydroxyphenyl)-7H-pyrrolo[2,3- d]pyrimidin-2-ylamino)-3- methoxy-N-methylbenzamide | US9623028, Compound 16
Type:
Small organic molecule
Emp. Form.:
C26H28N6O3
Mol. Mass.:
472.5389
SMILES:
CNC(=O)c1ccc(Nc2nc(NC3CCCC3)c3c(c[nH]c3n2)-c2ccc(O)cc2)c(OC)c1
: