Target
Dual specificity protein kinase TTK
Ligand
BDBM317463
Substrate
Meas. Tech.
Radioactivity Based Kinase Assay
IC50
13.3±n/a nM
Citation
 Zhu, DBoylan, JXu, SRiggs, JShi, TWurmser, AMikolon, DDeyanat-Yazdi, G Methods of treating a cancer using substituted pyrrolopyrimidine compounds, compositions thereof US Patent  US9623028 Publication Date 4/18/2017 
Target
Name:
Dual specificity protein kinase TTK
Synonyms:
Dual specificity protein kinase (TTK) MPS1 Monopolar Spindle 1 (MPS1) Monopolar Spindle 1 Kinase (MPS1) TTK | TTK_HUMAN
Type:
Protein
Mol. Mass.:
97086.79
Organism:
Homo sapiens (Human)
Description:
P33981
Residue:
857
  
Inhibitor
Name:
BDBM317463
Synonyms:
4-(4-(cyclopentyloxy)-5-(6- methoxypyridin-3-yl)-7H- pyrrolo[2,3-d]pyrimidin-2- ylamino)-3-methoxy-N- methylbenzamide | US9623028, Compound 55
Type:
Small organic molecule
Emp. Form.:
C26H28N6O4
Mol. Mass.:
488.5383
SMILES:
CNC(=O)c1ccc(Nc2nc(OC3CCCC3)c3c(c[nH]c3n2)-c2ccc(OC)nc2)c(OC)c1
: