Target
Dual specificity protein kinase CLK1
Ligand
BDBM317465
Substrate
Meas. Tech.
Radioactivity Based Kinase Assay
IC50
58.6±n/a nM
Citation
 Zhu, DBoylan, JXu, SRiggs, JShi, TWurmser, AMikolon, DDeyanat-Yazdi, G Methods of treating a cancer using substituted pyrrolopyrimidine compounds, compositions thereof US Patent  US9623028 Publication Date 4/18/2017 
Target
Name:
Dual specificity protein kinase CLK1
Synonyms:
CDC-like kinase 1 CDC2-like kinase 1 (CLK1) CLK1 Dual specificity protein kinase CLK1 Dual specificty protein kinase CLK1
Type:
Protein
Mol. Mass.:
57322.21
Organism:
Homo sapiens (Human)
Description:
P49759
Residue:
484
  
Inhibitor
Name:
BDBM317465
Synonyms:
4-(4-(cyclopentyloxy)-5-(4- (methylcarbamoyl)phenyl)-7H- pyrrolo[2,3-d]pyrimidin-2- ylamino)-3-methoxy-N- methylbenzamide | US9623028, Compound 79
Type:
Small organic molecule
Emp. Form.:
C28H30N6O4
Mol. Mass.:
514.5756
SMILES:
CNC(=O)c1ccc(cc1)-c1c[nH]c2nc(Nc3ccc(cc3OC)C(=O)NC)nc(OC3CCCC3)c12
: