Target
Calcium/calmodulin-dependent protein kinase kinase 2
Ligand
BDBM317465
Substrate
Meas. Tech.
Radioactivity Based Kinase Assay
IC50
34.0±n/a nM
Citation
 Zhu, DBoylan, JXu, SRiggs, JShi, TWurmser, AMikolon, DDeyanat-Yazdi, G Methods of treating a cancer using substituted pyrrolopyrimidine compounds, compositions thereof US Patent  US9623028 Publication Date 4/18/2017 
Target
Name:
Calcium/calmodulin-dependent protein kinase kinase 2
Synonyms:
CAMKK2 Calcium/calmodulin-dependent protein kinase kinase 2 (CaMKKB) KIAA0787 | KKCC2_HUMAN
Type:
Enzyme Catalytic Domain
Mol. Mass.:
64746.61
Organism:
Homo sapiens (Human)
Description:
gi_27437015
Residue:
588
  
Inhibitor
Name:
BDBM317465
Synonyms:
4-(4-(cyclopentyloxy)-5-(4- (methylcarbamoyl)phenyl)-7H- pyrrolo[2,3-d]pyrimidin-2- ylamino)-3-methoxy-N- methylbenzamide | US9623028, Compound 79
Type:
Small organic molecule
Emp. Form.:
C28H30N6O4
Mol. Mass.:
514.5756
SMILES:
CNC(=O)c1ccc(cc1)-c1c[nH]c2nc(Nc3ccc(cc3OC)C(=O)NC)nc(OC3CCCC3)c12
: