Target
Dual specificity protein kinase TTK
Ligand
BDBM317466
Substrate
Meas. Tech.
Radioactivity Based Kinase Assay
IC50
<1.5±n/a nM
Comments
0.000 12/22/2021
Citation
 Zhu, DBoylan, JXu, SRiggs, JShi, TWurmser, AMikolon, DDeyanat-Yazdi, G Methods of treating a cancer using substituted pyrrolopyrimidine compounds, compositions thereof US Patent  US9623028 Publication Date 4/18/2017 
Target
Name:
Dual specificity protein kinase TTK
Synonyms:
Dual specificity protein kinase (TTK) MPS1 Monopolar Spindle 1 (MPS1) Monopolar Spindle 1 Kinase (MPS1) TTK | TTK_HUMAN
Type:
Protein
Mol. Mass.:
97086.79
Organism:
Homo sapiens (Human)
Description:
P33981
Residue:
857
  
Inhibitor
Name:
BDBM317466
Synonyms:
4-(4-methoxy-5-(pyridin-4-yl)- 7H-pyrrolo[2,3-d]pyrimidin-2- ylamino)-N,N,3- trimethylbenzamide | US9623028, Compound 89
Type:
Small organic molecule
Emp. Form.:
C22H22N6O2
Mol. Mass.:
402.4491
SMILES:
COc1nc(Nc2ccc(cc2C)C(=O)N(C)C)nc2[nH]cc(-c3ccncc3)c12
: