Target
Dual specificity protein kinase CLK1
Ligand
BDBM317466
Substrate
Meas. Tech.
Radioactivity Based Kinase Assay
IC50
41.5±n/a nM
Citation
 Zhu, DBoylan, JXu, SRiggs, JShi, TWurmser, AMikolon, DDeyanat-Yazdi, G Methods of treating a cancer using substituted pyrrolopyrimidine compounds, compositions thereof US Patent  US9623028 Publication Date 4/18/2017 
Target
Name:
Dual specificity protein kinase CLK1
Synonyms:
CDC-like kinase 1 CDC2-like kinase 1 (CLK1) CLK1 Dual specificity protein kinase CLK1 Dual specificty protein kinase CLK1
Type:
Protein
Mol. Mass.:
57322.21
Organism:
Homo sapiens (Human)
Description:
P49759
Residue:
484
  
Inhibitor
Name:
BDBM317466
Synonyms:
4-(4-methoxy-5-(pyridin-4-yl)- 7H-pyrrolo[2,3-d]pyrimidin-2- ylamino)-N,N,3- trimethylbenzamide | US9623028, Compound 89
Type:
Small organic molecule
Emp. Form.:
C22H22N6O2
Mol. Mass.:
402.4491
SMILES:
COc1nc(Nc2ccc(cc2C)C(=O)N(C)C)nc2[nH]cc(-c3ccncc3)c12
: