Target
Dual specificity protein kinase TTK
Ligand
BDBM317473
Substrate
Meas. Tech.
Radioactivity Based Kinase Assay
IC50
2.12±n/a nM
Citation
 Zhu, DBoylan, JXu, SRiggs, JShi, TWurmser, AMikolon, DDeyanat-Yazdi, G Methods of treating a cancer using substituted pyrrolopyrimidine compounds, compositions thereof US Patent  US9623028 Publication Date 4/18/2017 
Target
Name:
Dual specificity protein kinase TTK
Synonyms:
Dual specificity protein kinase (TTK) MPS1 Monopolar Spindle 1 (MPS1) Monopolar Spindle 1 Kinase (MPS1) TTK | TTK_HUMAN
Type:
Protein
Mol. Mass.:
97086.79
Organism:
Homo sapiens (Human)
Description:
P33981
Residue:
857
  
Inhibitor
Name:
BDBM317473
Synonyms:
4-(5-(4-(1H-imidazol-2- yl)phenyl)-4-(tetrahydro-2H- pyran-4-yloxy)-7H-pyrrolo[2,3- d]pyrimidin-2-ylamino)-3- methoxy-N-methylbenzamide | US9623028, Compound 146
Type:
Small organic molecule
Emp. Form.:
C29H29N7O4
Mol. Mass.:
539.5851
SMILES:
CNC(=O)c1ccc(Nc2nc(OC3CCOCC3)c3c(c[nH]c3n2)-c2ccc(cc2)-c2ncc[nH]2)c(OC)c1
: