Target
Dual specificity protein kinase CLK1
Ligand
BDBM317475
Substrate
Meas. Tech.
Radioactivity Based Kinase Assay
IC50
82.8±n/a nM
Citation
 Zhu, DBoylan, JXu, SRiggs, JShi, TWurmser, AMikolon, DDeyanat-Yazdi, G Methods of treating a cancer using substituted pyrrolopyrimidine compounds, compositions thereof US Patent  US9623028 Publication Date 4/18/2017 
Target
Name:
Dual specificity protein kinase CLK1
Synonyms:
CDC-like kinase 1 CDC2-like kinase 1 (CLK1) CLK1 Dual specificity protein kinase CLK1 Dual specificty protein kinase CLK1
Type:
Protein
Mol. Mass.:
57322.21
Organism:
Homo sapiens (Human)
Description:
P49759
Residue:
484
  
Inhibitor
Name:
BDBM317475
Synonyms:
3-cyano-N-methyl-4-(5-(2- methylbenzo[d]oxazol-6-yl)-4- (tetrahydro-2H-pyran-4-yloxy)- 7H-pyrrolo[2,3-d]pyrimidin-2- ylamino)benzamide | US9623028, Compound 171
Type:
Small organic molecule
Emp. Form.:
C28H25N7O4
Mol. Mass.:
523.5426
SMILES:
CNC(=O)c1ccc(Nc2nc(OC3CCOCC3)c3c(c[nH]c3n2)-c2ccc3nc(C)oc3c2)c(c1)C#N
: