Target
Dual specificity protein kinase TTK
Ligand
BDBM317476
Substrate
Meas. Tech.
Radioactivity Based Kinase Assay
IC50
3.65±n/a nM
Citation
 Zhu, DBoylan, JXu, SRiggs, JShi, TWurmser, AMikolon, DDeyanat-Yazdi, G Methods of treating a cancer using substituted pyrrolopyrimidine compounds, compositions thereof US Patent  US9623028 Publication Date 4/18/2017 
Target
Name:
Dual specificity protein kinase TTK
Synonyms:
Dual specificity protein kinase (TTK) MPS1 Monopolar Spindle 1 (MPS1) Monopolar Spindle 1 Kinase (MPS1) TTK | TTK_HUMAN
Type:
Protein
Mol. Mass.:
97086.79
Organism:
Homo sapiens (Human)
Description:
P33981
Residue:
857
  
Inhibitor
Name:
BDBM317476
Synonyms:
N-methyl-4-(5-(2- methylbenzo[d]oxazol-6-yl)-4- (tetrahydro-2H-pyran-4-yloxy)- 7H-pyrrolo[2,3-d]pyrimidin-2- ylamino)-3- (trifluoromethyl)benzamide | US9623028, Compound 191
Type:
Small organic molecule
Emp. Form.:
C28H25F3N6O4
Mol. Mass.:
566.5311
SMILES:
CNC(=O)c1ccc(Nc2nc(OC3CCOCC3)c3c(c[nH]c3n2)-c2ccc3nc(C)oc3c2)c(c1)C(F)(F)F
: